i managed to compile moai-dev (linux branch) on Ubuntu 12.04 LTS (32bit and 64bit) […] I made a post on how i did it on my 32bit (old) notebook here -> http://oscar.morante.eu/blog/moai-on-debian/
Any idea what needs fixing here? This is moai-beta/linux-cmake-amd64@7a8771e on openSUSE 12.2 for x86_64. moai-beta/build$ make [ 16%] Built target Box2D [ 16%] Built target utf8 [ 17%] Built target tlsf [ 20%] Built target zipfs [ 40%] Built target uslscore [ 40%] Building CXX object src/moaicore/CMakeFiles/moaicore.dir/MOAICpArbiter.cpp.o src/moaicore/MOAICpArbiter.cpp: In static member function ‘static int MOAICpArbiter::_countContacts(lua_State*)’: src/moaicore/MOAICpArbiter.cpp:26:50: error: ‘cpArbiterGetCount’ was not declared in this scope src/moaicore/MOAICpArbiter.cpp: In static member function ‘static int MOAICpArbiter::_getContactDepth(lua_State*)’: src/moaicore/MOAICpArbiter.cpp:46:52: error: ‘cpArbiteGetDepth’ was not declared in this scope src/moaicore/MOAICpArbiter.cpp: In static member function ‘static int MOAICpArbiter::_isFirstContact(lua_State*)’: src/moaicore/MOAICpArbiter.cpp:148:58: error: ‘cpTrue’ was not declared in this scope make[2]: *** [src/moaicore/CMakeFiles/moaicore.dir/MOAICpArbiter.cpp.o] Fehler 1 make[1]: *** [src/moaicore/CMakeFiles/moaicore.dir/all] Fehler 2 make: *** [all] Fehler 2